{"text_format":"1","workbook":"xlsx","n_sheets":5,"sheets":["Formulario 2- Planta","Formulario 2A - Nómina","Formulario 2B- Programático","DESPLEGABLES","Programático"],"not_rendered":{"charts":0,"images":0,"macros":0,"external_links":2,"defined_names":41,"comments":3,"pivot_tables":0},"unopened":[],"bounds":{"document_bytes":16777216,"sheet_cells":100000,"rows_first":2000,"rows_last":500,"rows_between":2000,"halvings":0,"cell_chars":16384,"cell_head_chars":4096},"cells_cut":0,"cells_raw":0,"read":"whole","date_system":"1900"}

{"sheet":"Formulario 2- Planta","index":0,"n_rows":197,"n_cols":52,"rows_kept":197,"cut":false,"hidden":false,"merged":[[188,12,189,14],[190,12,191,14],[192,12,193,14],[176,12,177,14],[178,12,179,14],[180,12,181,14],[182,12,183,14],[184,12,185,14],[192,6,193,8],[190,6,191,8],[188,6,189,8],[186,6,187,8],[184,6,185,8],[182,6,183,8],[180,6,181,8],[178,6,179,8],[176,6,177,8],[11,48,13,48],[11,49,13,49],[10,48,10,50],[11,50,13,50],[11,47,13,47],[11,37,13,37],[11,38,13,38],[11,39,13,39],[11,40,13,40],[11,46,13,46],[11,45,13,45],[11,41,13,41],[11,42,13,42],[11,44,13,44],[12,19,13,19],[12,20,13,20],[11,22,13,22],[11,43,13,43],[12,21,13,21],[12,23,13,23],[12,24,13,24],[12,26,13,26],[12,25,13,25],[12,34,13,34],[11,23,11,26],[12,35,13,35],[11,36,13,36],[4,1,4,11],[10,37,10,47],[10,51,13,51],[10,2,13,2],[10,3,10,22],[11,3,11,16],[11,17,11,21],[12,3,12,4],[12,5,13,5],[10,23,10,36],[11,27,11,35],[12,27,13,27],[12,28,13,28],[12,29,13,29],[12,11,13,11],[12,12,13,12],[12,13,13,13],[12,16,13,16],[12,14,13,14],[12,6,13,6],[12,7,13,7],[12,8,13,8],[12,9,13,9],[12,10,13,10],[188,2,189,5],[171,2,173,5],[174,2,175,5],[12,17,13,17],[12,18,13,18],[176,2,177,5],[5,1,5,11],[8,3,8,10],[10,0,13,0],[10,1,13,1],[12,15,13,15],[178,2,179,5],[174,12,175,14],[174,9,175,11],[184,9,185,11],[182,9,183,11],[180,9,181,11],[178,9,179,11],[176,9,177,11],[172,9,173,11],[174,6,175,8],[171,12,173,14],[171,6,171,11],[186,12,187,14],[0,0,0,15],[1,0,1,15],[2,0,2,15],[6,1,6,11],[194,2,195,5],[196,2,197,5],[194,6,195,8],[196,6,197,8],[194,9,195,11],[194,12,195,14],[196,9,197,11],[196,12,197,14],[170,2,170,6],[192,9,193,11],[190,9,191,11],[188,9,189,11],[186,9,187,11],[190,2,191,5],[192,2,193,5],[172,6,173,8],[180,2,181,5],[182,2,183,5],[184,2,185,5],[186,2,187,5]]}
["MINISTERIO DE HACIENDA Y CRÉDITO PÚBLICO "]
["Dirección General del Presupuesto Público Nacional"]
["Formulario 2. Anteproyecto Planta de personal"]
[]
["CÓDIGO UEJ","370800"]
["UNIDAD EJECUTORA",{"$f":"+IFERROR(VLOOKUP(B5,DESPLEGABLES!$A$2:$C$229,2,0),\"\")","v":"UNIDAD NACIONAL DE PROTECCIÓN - UNP"}]
["SECTOR PRESUPUESTAL",{"$f":"+IFERROR(VLOOKUP(B5,DESPLEGABLES!$A$2:$C$229,3,0),\"\")","v":"INTERIOR"}]
[]
[null,0.10879999999999999,null,"ANTEPROYECTO PLANTA DE PERSONAL - VIGENCIA",null,null,null,null,null,null,null,2025,null,null,"(diligenciar en pesos)"]
[]
{"$rows_left_out":188}
{"sheet":"Formulario 2A - Nómina","index":1,"n_rows":84,"n_cols":262,"rows_kept":84,"cut":false,"hidden":false,"merged":[[8,1,8,4],[0,0,0,9],[1,0,1,9],[2,0,2,9],[4,2,4,8],[5,2,5,8],[8,5,8,7],[6,2,6,8],[82,7,82,8],[83,7,83,8],[10,1,12,1],[10,2,12,2],[10,3,12,3],[10,4,10,6],[10,7,12,7],[10,8,12,8],[11,4,12,4],[11,5,11,6]]}
["MINISTERIO DE HACIENDA Y CRÉDITO PÚBLICO "]
["Dirección General del Presupuesto Público Nacional"]
["Formulario 2A Certificación de Nómina"]
[]
[null,"CÓDIGO UEJ",{"$f":"+'Formulario 2- Planta'!B5","v":"370800"}]
[null,"UNIDAD EJECUTORA",{"$f":"+IFERROR(VLOOKUP(C5,DESPLEGABLES!$A$2:$C$229,2,0),\"\")","v":"UNIDAD NACIONAL DE PROTECCIÓN - UNP"}]
[null,"SECTOR PRESUPUESTAL",{"$f":"+IFERROR(VLOOKUP(C5,DESPLEGABLES!$A$2:$C$229,3,0),\"\")","v":"INTERIOR"}]
[]
[null,"ANTEPROYECTO COSTO DE NÓMINA - VIGENCIA",null,null,null,2025]
[]
{"$rows_left_out":75}
{"sheet":"Formulario 2B- Programático","index":2,"n_rows":177,"n_cols":21,"rows_kept":177,"cut":false,"hidden":false,"merged":[[175,1,175,12],[176,1,176,12],[171,1,171,12],[172,1,172,12],[173,1,173,12],[9,10,9,17],[174,1,174,12],[9,18,10,19],[142,0,142,9],[143,0,143,9],[169,1,169,12],[170,1,170,12],[5,1,5,9],[0,0,0,19],[1,0,1,19],[2,0,2,19],[4,1,4,9],[6,1,6,9],[9,0,10,0],[9,1,10,1],[9,2,10,2],[9,3,10,3],[9,5,10,5],[9,7,10,7],[9,9,10,9]]}
["MINISTERIO DE HACIENDA Y CRÉDITO PÚBLICO "]
["Dirección General del Presupuesto Público Nacional"]
["Formulario 2B. Anteproyecto Planta de personal - Clasificador Programatico"]
[]
["CÓDIGO UEJ",{"$f":"+'Formulario 2- Planta'!B5","v":"370800"}]
["UNIDAD EJECUTORA",{"$f":"+IFERROR(VLOOKUP(B5,DESPLEGABLES!$A$2:$C$229,2,0),\"\")","v":"UNIDAD NACIONAL DE PROTECCIÓN - UNP"}]
["SECTOR PRESUPUESTAL",{"$f":"+IFERROR(VLOOKUP(B5,DESPLEGABLES!$A$2:$C$229,3,0),\"\")","v":"INTERIOR"}]
[]
[]
["DENOMINACIÓN DE CARGOS","Grado","No. Cargos","Total Salario",null,"Total Remuneraciones no constitutivas de Factor Salarial",null,"Total Contribuciones Inherentes a la Nómina",null,"Total  \nGastos de personal","Dependencias con fines programaticos",null,null,null,null,null,null,null,"CHECK"]
{"$rows_left_out":168}
{"sheet":"DESPLEGABLES","index":3,"n_rows":229,"n_cols":38,"rows_kept":229,"cut":false,"hidden":true,"merged":[]}
["CÓDIGO","UNIDAD EJECUTORA ","SECTOR",null,"FONDOS ESPECIALES ","COD",null,"IMPUESTOS INDIRECTOS -FE","CÓD ",null,"CONTRIBUCIONES SOCIALES- EP","CÓD",null,"CONTRIBUCIONES SOCIALES -FE","CÓD",null,"CONTRIBUCIONES DIVERSAS - FE","CÓD",null,"CONTRIBUCIONES DIVERSAS - ESTAPÚBLICO","CÓD",null,"TASAS Y DERECHOS ADMINISTRATIVOS - EP","CÓD",null,"DERECHOS ECONÓMICOS POR USO DE RECURSOS NATURALES- EP","CÓD",null,"DERECHOS ECONÓMICOS POR USO DE RECURSOS NATURALES- FE","CÓD",null,"TRANSFERENCIAS CORRIENTES- EP","CÓD",null,"TRANSFERENCIAS CORRIENTES- FE","CÓD",null,"CPC"]
["010101","SENADO DE LA REPUBLICA","CONGRESO DE LA REPÚBLICA",null,"CONTRIBUCIÓN ENTIDADES VIGILADAS CONTRALORIA GENERAL NACION",602,null,"Impuesto social a las armas y municiones",10,null,"Salud","01",null,"Salud","01",null,"Contribución - Comisión de Regulación de Comunicaciones (CRC)","01",null,"Contribución - Superintendencia de Sociedades","04",null,"Expedición de visas","01",null,"Derecho económico por uso del subsuelo","01",null,"Autorización de uso de zonas de fondeo - DIMAR ","06",null,"Indemnizaciones relacionadas con seguros no de vida","01",null,"Indemnizaciones relacionadas con seguros no de vida","01",null,"Agricultura, silvicultura y productos de la pesca"]
["010102","CAMARA DE REPRESENTANTES","CONGRESO DE LA REPÚBLICA",null,"CONTRIBUCIÓN ENTIDADES VIGILADAS SUPERINTENDENCIA SUBSIDIO FAMILIAR",603,null,"Impuesto de remate y adjudicaciones",11,null,"Pensión","02",null,"Pensión","02",null,"Contribución - Comisión de Regulación de Energía y Gas (CREG)","02",null,"Contribución - Superintendencia de Vigilancia y Seguridad Privada","05",null,"Expedición de pasaportes","02",null,"Concesiones mineras","02",null,null,null,null,"Sentencias y conciliaciones","02",null,"Sentencias y conciliaciones","02",null,"Minerales; electricidad, gas y agua"]
["020101","PRESIDENCIA DE LA REPUBLICA - GESTION GENERAL","PRESIDENCIA DE LA REPÚBLICA",null,"FINANCIACION SECTOR JUSTICIA",609,null,"Sobretasa nacional a la gasolina",12,null,"Contribuciones asignaciones de retiro militares y policía","03",null,null,null,null,"Contribución - Comisión de Regulación de Agua Potable y Saneamiento Básico (CRA)","03",null,"Contribución - Superintendencia de la Economía Solidaria","06",null,"Apostilla o legalización","03",null,"Contraprestaciones portuarias","03",null,null,null,null,"Devolución IVA - Instituciones de educación superior ","04",null,"Prescripción de depósitos judiciales","03",null,"Productos alimenticios, bebidas y tabaco; textiles, prendas de vestir y productos de cuero"]
["020900","AGENCIA PRESIDENCIAL DE COOPERACION INTERNACIONAL DE COLOMBIA, APC - COLOMBIA ","PRESIDENCIA DE LA REPÚBLICA",null,"FONDO DE DEFENSA NACIONAL","6010",null,"Sobretasa al ACPM",13,null,null,null,null,null,null,null,"Contribución - Superintendencia del Subsidio Familiar","07",null,"Contribución de vigilancia - Superintendencia de Industria y Comercio","07",null,"Protocolización de escrituras públicas","04",null,"Concesiones parques naturales","05",null,null,null,null,"Transferencias de otras unidades de gobierno","05",null,"Devolución IVA - Instituciones de educación superior","04",null,"Otros bienes transportables, (excepto productos metálicos, maquinaria y equipo)"]
["021100","UNIDAD NACIONAL PARA LA GESTION DEL RIESGO DE DESASTRES ","PRESIDENCIA DE LA REPÚBLICA",null,"FONDO ESTUPEFACIENTES - MINSALUD","6013",null,"Impuesto de salida",15,null,"CONTRIBUCIONES ASOCIADAS A NÓMINA - EP","CÓD",null,"CONTRIBUCIONES ASOCIADAS A NÓMINA -FE","CÓD",null,"Contribución - Fondo de Compensación Ambiental",13,null,"Contribución de seguimiento - Superintendencia de Industria y Comercio","09",null,"Expedición de certificaciones en el exterior","05",null,null,null,null,null,null,null,"Recursos por bienes mostrencos y vocaciones hereditarias","07",null,"Transferencias de otras unidades de gobierno","05",null,"Productos metálicos, maquinaria y equipo"]
["021200","AGENCIA PARA LA REINCORPORACION Y LA NORMALIZACION - ARN","PRESIDENCIA DE LA REPÚBLICA",null,"FONDOS INTERNOS MINISTERIO DEFENSA","6014",null,null,null,null,"ICBF","01",null,"Escuelas industriales e institutos técnicos","04",null,"Contribución - Fondo Apoyo Financiero Zonas No Interconectadas (FAZNI) ",14,null,"Contribución - Superintendencia Financiera de Colombia","10",null,"Certificación sobre la existencia legal de sociedades","06",null,null,null,null,null,null,null,"Compensación UPC – SSS","09",null,"Recursos de terceros en consignación ","06",null,"Construcción y servicios de la construcción"]
["021300","AGENCIA NACIONAL INMOBILIARIA VIRGILIO BARCO VARGAS","PRESIDENCIA DE LA REPÚBLICA",null,"FONDOS INTERNOS POLICIA NACIONAL","6015",null,null,null,null,"SENA","02",null,"Aportes de cesantías","05",null,"Contribución - Fondo Apoyo Financiero para la Energización de las Zonas Rurales Interconectadas (FAER)",15,null,"Contribución - Superintendencia de Servicios Públicos Domiciliarios","11",null,"Reconocimiento y autenticación de firmas ante cónsules colombianos","07",null,"CÁLCULO POR INGRESOS CORRIENTES",null,null,null,null,null,"Mercancías Aprehendidas, Decomisadas o Abandonadas","11",null,"Recursos por procesos de extinción de dominio","08",null,"Servicios de venta y de distribución; alojamiento; servicios de suministro de comidas y bebidas; servicios de transporte; y servicios de distribución de electricidad, gas y agua"]
["021401","AGENCIA DE RENOVACION DEL TERRITORIO ART - GESTION GENERAL","PRESIDENCIA DE LA REPÚBLICA",null,"FONDO ROTATORIO DE MINAS Y ENERGÍA","6017",null,null,null,null,"ESAP","03",null,null,null,null,"Contribución - Fondo de Energías No Convencionales y Gestión Eficiente de la Energía (FENOGE)",16,null,"Contribucción - Superintendencia de Puertos y Transporte",12,null,"Expedición de tarjetas de registro consular","08",null,null,null,null,null,null,null,null,null,null,"Compensación UPC – SSS","09",null,"Servicios financieros y servicios conexos, servicios inmobiliarios y servicios de leasing"]
["021402","DIRECCIÓN DE SUSTITUCIÓN DE CULTIVOS DE USO ILÍCITO","PRESIDENCIA DE LA REPÚBLICA",null,"ESCUELAS INDUSTRIALES E INSTITUTOS TECNICOS","6019",null,null,null,null,null,null," ",null,null,null,"Contribución - Fondo Especial de Energía Social (FOES)",17,null,"Contribucción pensionados militares y policia",23,null,"Trámite de nacionalidad colombiana por adopción","09",null,"CONTRIBUCIONES SOCIALES- EP",null,null,"TASAS Y DERECHOS ADMINISTRATIVOS - EP",null,null,"IMPUESTOS INDIRECTOS -FE",null,null,"Recursos FRISCO",10,null,"Servicios prestados a las empresas y servicios de producción"]
{"$rows_left_out":220}
{"sheet":"Programático","index":4,"n_rows":1021,"n_cols":33,"rows_kept":1021,"cut":false,"hidden":true,"merged":[[0,0,0,9],[0,11,0,16]]}
["FUNCIONAMIENTO",null,null,null,null,null,null,null,null,null,null,"INVERSIÓN"]
["Código sector","Sector","Código programa","Programa","Código Subprograma","Subprograma","Código producto Final ","Producto Final ","Código operación de funcionamiento","Operación de funcionamiento",null,"Código sector","Sector","Código programa","Programa","Código Subprograma","Subprograma",null,null,"Sector","Programa 01","Programa 02","Programa 03","Programa 04","Programa 05","Programa 06","Programa 07","Programa 08","Programa 09","Programa 10","Programa 11","Programa 12","Conteo"]
[17,"AGRICULTURA Y DESARROLLO RURAL",1702,"Inclusión Productiva de pequeños productores rurales ","1100","Intersubsectorial Agricultura","01","Servicio de fortalecimiento de las capacidades productivas de los pequeños agricultores","01","Direccionamiento estratégico del sector ",null,17,"AGRICULTURA Y DESARROLLO RURAL",1702,"Inclusión Productiva de pequeños productores rurales ","1100","Intersubsectorial Agricultura",null,null,"AGRICULTURA Y DESARROLLO RURAL","1702 Inclusión Productiva de pequeños productores rurales ","1703 Servicios financieros y gestión del riesgo para las actividades agropecuarias y rurales","1704 Fortalecimiento de la gestión y dirección del sector Agricultura y Desarrollo Rural","1705 Restitución de tierras a víctimas del conflicto armado","1706 Aprovechamiento de mercados externos","1707 Sanidad agropecuaria e inocuidad agroalimentaria ","1708 Ciencia, tecnología e innovación agropecuaria","1709 Infraestructura productiva y comercialización ","1710 Acompañamiento a población rural y población rural vulnerable ","1799 fortalecimiento y apoyo a la gestión institucional del sector Agricultura y Desarrollo Rural","1700 No asignable a programas ",null,{"$f":"COUNTA(U3:AF3)","v":11}]
[17,"AGRICULTURA Y DESARROLLO RURAL",1702,"Inclusión Productiva de pequeños productores rurales ","1100","Intersubsectorial Agricultura","01","Servicio de fortalecimiento de las capacidades productivas de los pequeños agricultores","02","Gestión de políticas de apoyo productivo a los pequeños productores rurales",null,17,"AGRICULTURA Y DESARROLLO RURAL",1703,"Servicios financieros y gestión del riesgo para las actividades agropecuarias y rurales","1100","Intersubsectorial Agricultura",null,null,"AMBIENTE Y DESARROLLO SOSTENIBLE","3201 Fortalecimiento del desempeño ambiental de los sectores productivos","3202 Conservación de la biodiversidad y sus servicios ecosistémicos","3203 Gestión Integral del Recurso Hídrico","3204 Gestión de la información y el conocimiento ambiental","3205 Ordenamiento ambiental territorial","3206 Gestión del cambio climático para un desarrollo bajo en carbono y resiliente al clima","3207 Gestión integral de mares, costas y recursos acuáticos","3208 Educación Ambiental","3299 Fortalecimiento y apoyo a la gestión institucional del sectorAmbiente y Desarrollo Sostenible","3200 No asignable a programas",null,null,{"$f":"COUNTA(U4:AF4)","v":10}]
[17,"AGRICULTURA Y DESARROLLO RURAL",1702,"Inclusión Productiva de pequeños productores rurales ","1100","Intersubsectorial Agricultura","01","Servicio de fortalecimiento de las capacidades productivas de los pequeños agricultores","03","Gestión de asitencia técnica ",null,17,"AGRICULTURA Y DESARROLLO RURAL",1704,"Fortalecimiento de la gestión y dirección del sector Agricultura y Desarrollo Rural","1100","Intersubsectorial Agricultura",null,null,"CIENCIA, TECNOLOGÍA E INNOVACIÓN","3999 Fortalecimiento y apoyo a la gestión institucional del sector Ciencia y Tecnología","3900 No asignable a programas",null,null,null,null,null,null,null,null,null,null,2]
[17,"AGRICULTURA Y DESARROLLO RURAL",1702,"Inclusión Productiva de pequeños productores rurales ","1100","Intersubsectorial Agricultura","01","Servicio de fortalecimiento de las capacidades productivas de los pequeños agricultores","04","Gestión de acceso a activos productivos",null,17,"AGRICULTURA Y DESARROLLO RURAL",1705,"Restitución de tierras a víctimas del conflicto armado","1100","Intersubsectorial Agricultura",null,null,"COMERCIO, INDUSTRIA Y TURISMO","3501 Internacionalización de la economía ","3502 Productividad y competitividad de las empresas colombianas ","3503 Ambiente regulatorio y económico para la competencia y la actividad empresarial","3504 Competitividad, sostenibilidad y promoción del turismo colombiano ","3599 Fortalecimiento y apoyo a la gestión institucional del sector Comercio, Industria y Turismo","3500 No asignable a programas",null,null,null,null,null,null,6]
[17,"AGRICULTURA Y DESARROLLO RURAL",1702,"Inclusión Productiva de pequeños productores rurales ","1100","Intersubsectorial Agricultura","01","Servicio de fortalecimiento de las capacidades productivas de los pequeños agricultores","05","Promoción y fomento de proyectos de pequeños productores",null,17,"AGRICULTURA Y DESARROLLO RURAL",1706,"Aprovechamiento de mercados externos","1100","Intersubsectorial Agricultura",null,null,"CONGRESO DE LA REPÚBLICA","0101 Mejoramiento de la eficiencia y la transparencia legislativa","0199 Fortalecimiento y apoyo a la gestión institucional del sector Congreso de la República ","0100 No asignable a programas",null,null,null,null,null,null,null,null,null,3]
[17,"AGRICULTURA Y DESARROLLO RURAL",1703,"Servicios financieros y gestión del riesgo para las actividades agropecuarias y rurales","1100","Intersubsectorial Agricultura","01","servicio de inclusión financiera para los productores rurales ","01","Direccionamiento estratégico del sector ",null,17,"AGRICULTURA Y DESARROLLO RURAL",1707,"Sanidad agropecuaria e inocuidad agroalimentaria ","1100","Intersubsectorial Agricultura",null,null,"CULTURA","3301 Promoción y acceso efectivo a procesos culturales y artísticos","3302 Gestión, protección y salvaguardia del patrimonio cultural colombiano","3399 Fortalecimiento y apoyo a la gestión institucional del sector Cultura","3300 No asignable a programas",null,null,null,null,null,null,null,null,4]
[17,"AGRICULTURA Y DESARROLLO RURAL",1703,"Servicios financieros y gestión del riesgo para las actividades agropecuarias y rurales","1100","Intersubsectorial Agricultura","01","servicio de inclusión financiera para los productores rurales ","02","Gestión de la política de inclusión financiera para los productores rurales",null,17,"AGRICULTURA Y DESARROLLO RURAL",1708,"Ciencia, tecnología e innovación agropecuaria","1100","Intersubsectorial Agricultura",null,null,"DEFENSA Y POLICÍA","1501 Capacidades de la Policía Nacional en seguridad pública, prevención, convivencia y seguridad ciudadana","1502 Capacidades de la Policía Nacional en seguridad pública, prevención, convivencia y seguridad ciudadana","1504 Desarrollo marítimo, fluvial y costero desde el sector defensa","1505 Generación de bienestar para la Fuerza Pública y sus familias","1506 Gestión del riesgo de desastres desde el sector Defensa y Seguridad","1508 Inspección, Vigilancia y Control de la prestación del servicio de vigilancia y seguridad privada","1599 Fortalecimiento y apoyo a la gestión institucional del sector Defensa y Policía","1500 No asignable a programas",null,null,null,null,8]
[17,"AGRICULTURA Y DESARROLLO RURAL",1703,"Servicios financieros y gestión del riesgo para las actividades agropecuarias y rurales","1100","Intersubsectorial Agricultura","01","servicio de inclusión financiera para los productores rurales ","03","Gestión de cofinanciación para proyectos productivos ",null,17,"AGRICULTURA Y DESARROLLO RURAL",1709,"Infraestructura productiva y comercialización ","1100","Intersubsectorial Agricultura",null,null,"DEPORTE Y RECREACIÓN","4301 Fomento a la recreación, la actividad física y el deporte","4302 Formación y preparación de deportistas","4399 Fortalecimiento y apoyo a la gestión institucional del sector Recreación y Deporte","4300 No programático",null,null,null,null,null,null,null,null,4]
{"$rows_left_out":1011}